{"text_format":"2","workbook":"xlsx","n_sheets":7,"sheets":["approach","manual","players","config","pregame","round1","styles"],"not_rendered":{"charts":0,"images":0,"macros":0,"external_links":0,"defined_names":0,"comments":0,"pivot_tables":0},"unopened":[],"bounds":{"document_bytes":16777216,"sheet_cells":100000,"run_cost":"one","rows_first":2000,"rows_last":500,"rows_between":2000,"halvings":0,"cell_chars":16384,"cell_head_chars":4096},"cells_cut":0,"cells_raw":0,"read":"whole","date_system":"1900"}

{"sheet":"approach","index":0,"n_rows":15,"n_cols":1,"rows_kept":15,"cut":false,"hidden":true,"merged":[]}
["Import into tool"]
["1. Load players from 'players'"]
["2. Load scores from 'scores', determine distance from RANK"]
["3. Determine round to plan from next empty column in 'players'"]
["4. determine prohibitedPairs and DiscouragePairs from settings"]
[]
["Run planning"]
[]
["Export into excel"]
["1. Duplicate excel with -N (where N is round number)"]
["2. Create tab with 'RoundN'"]
["3. Fill it based on the template"]
["4. Update 'players' tab with the VLOOKUPS for RoundN tab"]
["5. Insert or Replace '# of times people have seen each other matrix' in 'Seen'"]
["6. Set default worksheet (players)"]

{"sheet":"manual","index":1,"n_rows":17,"n_cols":2,"rows_kept":17,"cut":false,"hidden":false,"merged":[]}
[]
[null,"Setup:"]
[null,"Add all players in the 'players' tab"]
[null,"Add any special options in the 'settings' tab. Mostly if certain people should or should not be planned together"]
[]
[null,"Pregame:"]
[null,"Add all pre-game scores"]
[]
[null,"Plan:"]
[null,"Run the planner to generate the excel with the first/next round planned"]
[]
[null,"Play:"]
[null,"Add the scores in the 'roundX' tab"]
[null,"GOTO line 9"]
[]
[null,"WARNING"]
[null,"DO NOT EDIT TAB NAMES, INSERT COLUMNS OR ROWS"]

{"sheet":"players","index":2,"n_rows":25,"n_cols":6,"rows_kept":25,"cut":false,"hidden":false,"merged":[]}
["ID","Score","Name","Rank","Pre-game","Round1"]
[1,{"$f":"SUM(E2:K2)","v":10},"Olivia",{"$f":"_xlfn.RANK.EQ(B2,$B$2:$B$25,0)","v":9},{"$f":"pregame!C2","v":3},{"$f":"VLOOKUP(players!A2,round1!B:D,3,FALSE)","v":7}]
[2,{"$f":"SUM(E3:K3)","v":8},"Ethan",{"$f":"_xlfn.RANK.EQ(B3,$B$2:$B$25,0)","v":15},{"$f":"pregame!C3","v":0},{"$f":"VLOOKUP(players!A3,round1!B:D,3,FALSE)","v":8}]
[3,12,"Ava",{"$f":"_xlfn.RANK.EQ(B4,$B$2:$B$25,0)","v":4},{"$f":"pregame!C4","v":5},{"$f":"VLOOKUP(players!A4,round1!B:D,3,FALSE)","v":7}]
[4,10,"Lucas",{"$f":"_xlfn.RANK.EQ(B5,$B$2:$B$25,0)","v":9},{"$f":"pregame!C5","v":7},{"$f":"VLOOKUP(players!A5,round1!B:D,3,FALSE)","v":3}]
[5,13,"Sophia",{"$f":"_xlfn.RANK.EQ(B6,$B$2:$B$25,0)","v":2},{"$f":"pregame!C6","v":6},{"$f":"VLOOKUP(players!A6,round1!B:D,3,FALSE)","v":7}]
[6,11,"Liam",{"$f":"_xlfn.RANK.EQ(B7,$B$2:$B$25,0)","v":6},{"$f":"pregame!C7","v":5},{"$f":"VLOOKUP(players!A7,round1!B:D,3,FALSE)","v":6}]
[7,8,"Isabella",{"$f":"_xlfn.RANK.EQ(B8,$B$2:$B$25,0)","v":15},{"$f":"pregame!C8","v":3},{"$f":"VLOOKUP(players!A8,round1!B:D,3,FALSE)","v":5}]
[8,6,"Mason",{"$f":"_xlfn.RANK.EQ(B9,$B$2:$B$25,0)","v":20},{"$f":"pregame!C9","v":2},{"$f":"VLOOKUP(players!A9,round1!B:D,3,FALSE)","v":4}]
[9,11,"Mia",{"$f":"_xlfn.RANK.EQ(B10,$B$2:$B$25,0)","v":6},{"$f":"pregame!C10","v":6},{"$f":"VLOOKUP(players!A10,round1!B:D,3,FALSE)","v":5}]
[10,12,"Benjamin",{"$f":"_xlfn.RANK.EQ(B11,$B$2:$B$25,0)","v":4},{"$f":"pregame!C11","v":5},{"$f":"VLOOKUP(players!A11,round1!B:D,3,FALSE)","v":7}]
[11,9,"Charlotte",{"$f":"_xlfn.RANK.EQ(B12,$B$2:$B$25,0)","v":14},{"$f":"pregame!C12","v":4},{"$f":"VLOOKUP(players!A12,round1!B:D,3,FALSE)","v":5}]
[12,10,"Noah",{"$f":"_xlfn.RANK.EQ(B13,$B$2:$B$25,0)","v":9},{"$f":"pregame!C13","v":2},{"$f":"VLOOKUP(players!A13,round1!B:D,3,FALSE)","v":8}]
[13,16,"Amelia",{"$f":"_xlfn.RANK.EQ(B14,$B$2:$B$25,0)","v":1},{"$f":"pregame!C14","v":6},{"$f":"VLOOKUP(players!A14,round1!B:D,3,FALSE)","v":10}]
[14,13,"James",{"$f":"_xlfn.RANK.EQ(B15,$B$2:$B$25,0)","v":2},{"$f":"pregame!C15","v":6},{"$f":"VLOOKUP(players!A15,round1!B:D,3,FALSE)","v":7}]
[15,7,"Harper",{"$f":"_xlfn.RANK.EQ(B16,$B$2:$B$25,0)","v":18},{"$f":"pregame!C16","v":4},{"$f":"VLOOKUP(players!A16,round1!B:D,3,FALSE)","v":3}]
[16,5,"Henry",{"$f":"_xlfn.RANK.EQ(B17,$B$2:$B$25,0)","v":22},{"$f":"pregame!C17","v":2},{"$f":"VLOOKUP(players!A17,round1!B:D,3,FALSE)","v":3}]
[17,6,"Evelyn",{"$f":"_xlfn.RANK.EQ(B18,$B$2:$B$25,0)","v":20},{"$f":"pregame!C18","v":2},{"$f":"VLOOKUP(players!A18,round1!B:D,3,FALSE)","v":4}]
[18,10,"Alexander",{"$f":"_xlfn.RANK.EQ(B19,$B$2:$B$25,0)","v":9},{"$f":"pregame!C19","v":6},{"$f":"VLOOKUP(players!A19,round1!B:D,3,FALSE)","v":4}]
[19,7,"Scarlett",{"$f":"_xlfn.RANK.EQ(B20,$B$2:$B$25,0)","v":18},{"$f":"pregame!C20","v":4},{"$f":"VLOOKUP(players!A20,round1!B:D,3,FALSE)","v":3}]
[20,11,"Daniel",{"$f":"_xlfn.RANK.EQ(B21,$B$2:$B$25,0)","v":6},{"$f":"pregame!C21","v":6},{"$f":"VLOOKUP(players!A21,round1!B:D,3,FALSE)","v":5}]
[21,8,"Emily",{"$f":"_xlfn.RANK.EQ(B22,$B$2:$B$25,0)","v":15},{"$f":"pregame!C22","v":1},{"$f":"VLOOKUP(players!A22,round1!B:D,3,FALSE)","v":7}]
[22,10,"Jack",{"$f":"_xlfn.RANK.EQ(B23,$B$2:$B$25,0)","v":9},{"$f":"pregame!C23","v":4},{"$f":"VLOOKUP(players!A23,round1!B:D,3,FALSE)","v":6}]
[23,0,"Empty",{"$f":"_xlfn.RANK.EQ(B24,$B$2:$B$25,0)","v":23},0,0]
[24,0,"Empty",{"$f":"_xlfn.RANK.EQ(B25,$B$2:$B$25,0)","v":23},0,0]

{"sheet":"config","index":3,"n_rows":17,"n_cols":12,"rows_kept":17,"cut":false,"hidden":false,"merged":[]}
["ProhibitedPairs",{"$nulls":4},"DiscouragedPairs",{"$nulls":4},"UnweightedPlayers"]
["ID1","ID2","Name1","Name2",null,"ID1","ID2","Name1","Name2",null,"ID","Name"]
[23,24,{"$f":"IFERROR(VLOOKUP(A3,players!$A:$C,3,0),\"\")","v":"Empty"},{"$f":"IFERROR(VLOOKUP(B3,players!$A:$C,3,0),\"\")","v":"Empty"},null,1,2,{"$f":"IFERROR(VLOOKUP(F3,players!$A:$C,3,0),\"\")","v":"Olivia"},{"$f":"IFERROR(VLOOKUP(G3,players!$A:$C,3,0),\"\")","v":"Ethan"},null,23,{"$f":"IFERROR(VLOOKUP(K3,players!$A:$C,3,0),\"\")","v":"Empty"}]
[null,null,{"$f":"IFERROR(VLOOKUP(A4,players!$A:$C,3,0),\"\")","v":""},{"$f":"IFERROR(VLOOKUP(B4,players!$A:$C,3,0),\"\")","v":""},null,null,null,{"$f":"IFERROR(VLOOKUP(F4,players!$A:$C,3,0),\"\")","v":""},{"$f":"IFERROR(VLOOKUP(G4,players!$A:$C,3,0),\"\")","v":""},null,24,{"$f":"IFERROR(VLOOKUP(K4,players!$A:$C,3,0),\"\")","v":"Empty"}]
[null,null,{"$f":"IFERROR(VLOOKUP(A5,players!$A:$C,3,0),\"\")","v":""},{"$f":"IFERROR(VLOOKUP(B5,players!$A:$C,3,0),\"\")","v":""},null,null,null,{"$f":"IFERROR(VLOOKUP(F5,players!$A:$C,3,0),\"\")","v":""},{"$f":"IFERROR(VLOOKUP(G5,players!$A:$C,3,0),\"\")","v":""},null,null,{"$f":"IFERROR(VLOOKUP(K5,players!$A:$C,3,0),\"\")","v":""}]
[null,null,{"$f":"IFERROR(VLOOKUP(A6,players!$A:$C,3,0),\"\")","v":""},{"$f":"IFERROR(VLOOKUP(B6,players!$A:$C,3,0),\"\")","v":""},null,null,null,{"$f":"IFERROR(VLOOKUP(F6,players!$A:$C,3,0),\"\")","v":""},{"$f":"IFERROR(VLOOKUP(G6,players!$A:$C,3,0),\"\")","v":""},null,null,{"$f":"IFERROR(VLOOKUP(K6,players!$A:$C,3,0),\"\")","v":""}]
[null,null,{"$f":"IFERROR(VLOOKUP(A7,players!$A:$C,3,0),\"\")","v":""},{"$f":"IFERROR(VLOOKUP(B7,players!$A:$C,3,0),\"\")","v":""},null,null,null,{"$f":"IFERROR(VLOOKUP(F7,players!$A:$C,3,0),\"\")","v":""},{"$f":"IFERROR(VLOOKUP(G7,players!$A:$C,3,0),\"\")","v":""},null,null,{"$f":"IFERROR(VLOOKUP(K7,players!$A:$C,3,0),\"\")","v":""}]
[null,null,{"$f":"IFERROR(VLOOKUP(A8,players!$A:$C,3,0),\"\")","v":""},{"$f":"IFERROR(VLOOKUP(B8,players!$A:$C,3,0),\"\")","v":""},null,null,null,{"$f":"IFERROR(VLOOKUP(F8,players!$A:$C,3,0),\"\")","v":""},{"$f":"IFERROR(VLOOKUP(G8,players!$A:$C,3,0),\"\")","v":""},null,null,{"$f":"IFERROR(VLOOKUP(K8,players!$A:$C,3,0),\"\")","v":""}]
[null,null,{"$f":"IFERROR(VLOOKUP(A9,players!$A:$C,3,0),\"\")","v":""},{"$f":"IFERROR(VLOOKUP(B9,players!$A:$C,3,0),\"\")","v":""},null,null,null,{"$f":"IFERROR(VLOOKUP(F9,players!$A:$C,3,0),\"\")","v":""},{"$f":"IFERROR(VLOOKUP(G9,players!$A:$C,3,0),\"\")","v":""},null,null,{"$f":"IFERROR(VLOOKUP(K9,players!$A:$C,3,0),\"\")","v":""}]
[null,null,{"$f":"IFERROR(VLOOKUP(A10,players!$A:$C,3,0),\"\")","v":""},{"$f":"IFERROR(VLOOKUP(B10,players!$A:$C,3,0),\"\")","v":""},null,null,null,{"$f":"IFERROR(VLOOKUP(F10,players!$A:$C,3,0),\"\")","v":""},{"$f":"IFERROR(VLOOKUP(G10,players!$A:$C,3,0),\"\")","v":""},null,null,{"$f":"IFERROR(VLOOKUP(K10,players!$A:$C,3,0),\"\")","v":""}]
[null,null,{"$f":"IFERROR(VLOOKUP(A11,players!$A:$C,3,0),\"\")","v":""},{"$f":"IFERROR(VLOOKUP(B11,players!$A:$C,3,0),\"\")","v":""},null,null,null,{"$f":"IFERROR(VLOOKUP(F11,players!$A:$C,3,0),\"\")","v":""},{"$f":"IFERROR(VLOOKUP(G11,players!$A:$C,3,0),\"\")","v":""},null,null,{"$f":"IFERROR(VLOOKUP(K11,players!$A:$C,3,0),\"\")","v":""}]
[null,null,{"$f":"IFERROR(VLOOKUP(A12,players!$A:$C,3,0),\"\")","v":""},{"$f":"IFERROR(VLOOKUP(B12,players!$A:$C,3,0),\"\")","v":""},null,null,null,{"$f":"IFERROR(VLOOKUP(F12,players!$A:$C,3,0),\"\")","v":""},{"$f":"IFERROR(VLOOKUP(G12,players!$A:$C,3,0),\"\")","v":""},null,null,{"$f":"IFERROR(VLOOKUP(K12,players!$A:$C,3,0),\"\")","v":""}]
[null,null,{"$f":"IFERROR(VLOOKUP(A13,players!$A:$C,3,0),\"\")","v":""},{"$f":"IFERROR(VLOOKUP(B13,players!$A:$C,3,0),\"\")","v":""},null,null,null,{"$f":"IFERROR(VLOOKUP(F13,players!$A:$C,3,0),\"\")","v":""},{"$f":"IFERROR(VLOOKUP(G13,players!$A:$C,3,0),\"\")","v":""},null,null,{"$f":"IFERROR(VLOOKUP(K13,players!$A:$C,3,0),\"\")","v":""}]
[null,null,{"$f":"IFERROR(VLOOKUP(A14,players!$A:$C,3,0),\"\")","v":""},{"$f":"IFERROR(VLOOKUP(B14,players!$A:$C,3,0),\"\")","v":""},null,null,null,{"$f":"IFERROR(VLOOKUP(F14,players!$A:$C,3,0),\"\")","v":""},{"$f":"IFERROR(VLOOKUP(G14,players!$A:$C,3,0),\"\")","v":""},null,null,{"$f":"IFERROR(VLOOKUP(K14,players!$A:$C,3,0),\"\")","v":""}]
[null,null,{"$f":"IFERROR(VLOOKUP(A15,players!$A:$C,3,0),\"\")","v":""},{"$f":"IFERROR(VLOOKUP(B15,players!$A:$C,3,0),\"\")","v":""},null,null,null,{"$f":"IFERROR(VLOOKUP(F15,players!$A:$C,3,0),\"\")","v":""},{"$f":"IFERROR(VLOOKUP(G15,players!$A:$C,3,0),\"\")","v":""},null,null,{"$f":"IFERROR(VLOOKUP(K15,players!$A:$C,3,0),\"\")","v":""}]
[null,null,{"$f":"IFERROR(VLOOKUP(A16,players!$A:$C,3,0),\"\")","v":""},{"$f":"IFERROR(VLOOKUP(B16,players!$A:$C,3,0),\"\")","v":""},null,null,null,{"$f":"IFERROR(VLOOKUP(F16,players!$A:$C,3,0),\"\")","v":""},{"$f":"IFERROR(VLOOKUP(G16,players!$A:$C,3,0),\"\")","v":""},null,null,{"$f":"IFERROR(VLOOKUP(K16,players!$A:$C,3,0),\"\")","v":""}]
[null,null,{"$f":"IFERROR(VLOOKUP(A17,players!$A:$C,3,0),\"\")","v":""},{"$f":"IFERROR(VLOOKUP(B17,players!$A:$C,3,0),\"\")","v":""},null,null,null,{"$f":"IFERROR(VLOOKUP(F17,players!$A:$C,3,0),\"\")","v":""},{"$f":"IFERROR(VLOOKUP(G17,players!$A:$C,3,0),\"\")","v":""},null,null,{"$f":"IFERROR(VLOOKUP(K17,players!$A:$C,3,0),\"\")","v":""}]

{"sheet":"pregame","index":4,"n_rows":25,"n_cols":6,"rows_kept":25,"cut":false,"hidden":false,"merged":[]}
["ID","Name","Score","colors","value","etc"]
[{"$f":"players!A2","v":1},{"$f":"players!C2","v":"Olivia"},{"$f":"SUM(D2:F2)","v":3},2,0,1]
[{"$f":"players!A3","v":2},{"$f":"players!C3","v":"Ethan"},{"$f":"SUM(D3:F3)","v":0},0,0,0]
[{"$f":"players!A4","v":3},{"$f":"players!C4","v":"Ava"},5,3,0,2]
[{"$f":"players!A5","v":4},{"$f":"players!C5","v":"Lucas"},7,3,2,2]
[{"$f":"players!A6","v":5},{"$f":"players!C6","v":"Sophia"},6,0,3,3]
[{"$f":"players!A7","v":6},{"$f":"players!C7","v":"Liam"},5,2,0,3]
[{"$f":"players!A8","v":7},{"$f":"players!C8","v":"Isabella"},3,1,0,2]
[{"$f":"players!A9","v":8},{"$f":"players!C9","v":"Mason"},2,1,1,0]
[{"$f":"players!A10","v":9},{"$f":"players!C10","v":"Mia"},6,3,1,2]
[{"$f":"players!A11","v":10},{"$f":"players!C11","v":"Benjamin"},5,0,2,3]
[{"$f":"players!A12","v":11},{"$f":"players!C12","v":"Charlotte"},4,3,0,1]
[{"$f":"players!A13","v":12},{"$f":"players!C13","v":"Noah"},2,0,0,2]
[{"$f":"players!A14","v":13},{"$f":"players!C14","v":"Amelia"},6,2,2,2]
[{"$f":"players!A15","v":14},{"$f":"players!C15","v":"James"},6,2,2,2]
[{"$f":"players!A16","v":15},{"$f":"players!C16","v":"Harper"},4,2,2,0]
[{"$f":"players!A17","v":16},{"$f":"players!C17","v":"Henry"},2,1,1,0]
[{"$f":"players!A18","v":17},{"$f":"players!C18","v":"Evelyn"},2,0,1,1]
[{"$f":"players!A19","v":18},{"$f":"players!C19","v":"Alexander"},6,2,1,3]
[{"$f":"players!A20","v":19},{"$f":"players!C20","v":"Scarlett"},4,2,1,1]
[{"$f":"players!A21","v":20},{"$f":"players!C21","v":"Daniel"},6,3,2,1]
[{"$f":"players!A22","v":21},{"$f":"players!C22","v":"Emily"},1,0,1,0]
[{"$f":"players!A23","v":22},{"$f":"players!C23","v":"Jack"},4,3,0,1]
[{"$f":"players!A24","v":23},{"$f":"players!C24","v":"Empty"},5,1,1,3]
[{"$f":"players!A25","v":24},{"$f":"players!C25","v":"Empty"},3,0,3,0]

{"sheet":"round1","index":5,"n_rows":30,"n_cols":8,"rows_kept":30,"cut":false,"hidden":false,"merged":[]}
["Table","ID","Name","Score","First Blood","SP Uitgeschakeld","Commander damage","Winpunten"]
["Table1",1,{"$f":"VLOOKUP(B2,players!A:C,3,FALSE)","v":"Olivia"},{"$f":"SUM(E2:H2)","v":7},3,0,1,3]
[null,2,{"$f":"VLOOKUP(B3,players!A:C,3,FALSE)","v":"Ethan"},{"$f":"SUM(E3:H3)","v":8},2,0,3,3]
[null,3,{"$f":"VLOOKUP(B4,players!A:C,3,FALSE)","v":"Ava"},{"$f":"SUM(E4:H4)","v":7},1,3,1,2]
[null,4,{"$f":"VLOOKUP(B5,players!A:C,3,FALSE)","v":"Lucas"},{"$f":"SUM(E5:H5)","v":3},0,0,1,2]
[]
["Table2",5,{"$f":"VLOOKUP(B7,players!A:C,3,FALSE)","v":"Sophia"},{"$f":"SUM(E7:H7)","v":7},2,0,2,3]
[null,6,{"$f":"VLOOKUP(B8,players!A:C,3,FALSE)","v":"Liam"},{"$f":"SUM(E8:H8)","v":6},1,0,3,2]
[null,7,{"$f":"VLOOKUP(B9,players!A:C,3,FALSE)","v":"Isabella"},{"$f":"SUM(E9:H9)","v":5},3,0,0,2]
[null,8,{"$f":"VLOOKUP(B10,players!A:C,3,FALSE)","v":"Mason"},{"$f":"SUM(E10:H10)","v":4},1,2,1,0]
[]
["Table3",9,{"$f":"VLOOKUP(B12,players!A:C,3,FALSE)","v":"Mia"},{"$f":"SUM(E12:H12)","v":5},1,3,1,0]
[null,10,{"$f":"VLOOKUP(B13,players!A:C,3,FALSE)","v":"Benjamin"},{"$f":"SUM(E13:H13)","v":7},2,0,2,3]
[null,11,{"$f":"VLOOKUP(B14,players!A:C,3,FALSE)","v":"Charlotte"},{"$f":"SUM(E14:H14)","v":5},3,1,0,1]
[null,12,{"$f":"VLOOKUP(B15,players!A:C,3,FALSE)","v":"Noah"},{"$f":"SUM(E15:H15)","v":8},1,2,3,2]
[]
["Table4",13,{"$f":"VLOOKUP(B17,players!A:C,3,FALSE)","v":"Amelia"},{"$f":"SUM(E17:H17)","v":10},3,1,3,3]
[null,14,{"$f":"VLOOKUP(B18,players!A:C,3,FALSE)","v":"James"},{"$f":"SUM(E18:H18)","v":7},2,0,2,3]
[null,15,{"$f":"VLOOKUP(B19,players!A:C,3,FALSE)","v":"Harper"},{"$f":"SUM(E19:H19)","v":3},0,3,0,0]
[null,16,{"$f":"VLOOKUP(B20,players!A:C,3,FALSE)","v":"Henry"},{"$f":"SUM(E20:H20)","v":3},1,0,0,2]
[]
["Table5",17,{"$f":"VLOOKUP(B22,players!A:C,3,FALSE)","v":"Evelyn"},{"$f":"SUM(E22:H22)","v":4},1,0,0,3]
[null,18,{"$f":"VLOOKUP(B23,players!A:C,3,FALSE)","v":"Alexander"},{"$f":"SUM(E23:H23)","v":4},1,0,2,1]
[null,19,{"$f":"VLOOKUP(B24,players!A:C,3,FALSE)","v":"Scarlett"},{"$f":"SUM(E24:H24)","v":3},0,1,2,0]
[null,23,{"$f":"VLOOKUP(B25,players!A:C,3,FALSE)","v":"Empty"},{"$f":"SUM(E25:H25)","v":0},0,0,0,0]
[]
["Table6",20,{"$f":"VLOOKUP(B27,players!A:C,3,FALSE)","v":"Daniel"},{"$f":"SUM(E27:H27)","v":5},1,1,3,0]
[null,21,{"$f":"VLOOKUP(B28,players!A:C,3,FALSE)","v":"Emily"},{"$f":"SUM(E28:H28)","v":7},3,3,0,1]
[null,22,{"$f":"VLOOKUP(B29,players!A:C,3,FALSE)","v":"Jack"},{"$f":"SUM(E29:H29)","v":6},0,3,1,2]
[null,24,{"$f":"VLOOKUP(B30,players!A:C,3,FALSE)","v":"Empty"},{"$f":"SUM(E30:H30)","v":0},0,0,0,0]

{"sheet":"styles","index":6,"n_rows":3,"n_cols":2,"rows_kept":3,"cut":false,"hidden":true,"merged":[]}
["Table","Headerstyle"]
[null,"Inputstyle"]
[1,"numberstyle"]